Developers' Forum

Problem with instalation Jobe

Problem with instalation Jobe

by Al Spay -
Number of replies: 1

Installed the server according to https://github.com/trampgeek/jobe

As a result, the validation test fails. Little experience with Linux. I ask for help.

Supported languages:

    c: 7.5.0

    cpp: 7.5.0

    java: 11.0.8

    nodejs: 8.10.0

    pascal: 3.0.4

    php: 7.2.24

    python3: 3.6.9



***************** FAILED TEST ******************


{'run_id': None, 'outcome': 11, 'cmpinfo': 'sudo: unable to resolve host ruvds-5                                                                                                                     dpq3\n', 'stdout': '', 'stderr': ''}

Valid Python3

Jobe result: Compile error


Compiler output:

sudo: unable to resolve host ruvds-5dpq3




************************************************



***************** FAILED TEST ******************


{'run_id': None, 'outcome': 11, 'cmpinfo': 'sudo: unable to resolve host ruvds-5dpq3\n', 'stdout': '', 'stderr': ''}

Python3 with stdin

Jobe result: Compile error


Compiler output:

sudo: unable to resolve host ruvds-5dpq3




************************************************


Syntactically invalid Python3 OK


***************** FAILED TEST ******************


{'run_id': None, 'outcome': 11, 'cmpinfo': 'sudo: unable to resolve host ruvds-5dpq3\n', 'stdout': '', 'stderr': ''}

Python3 runtime error

Jobe result: Compile error


Compiler output:

sudo: unable to resolve host ruvds-5dpq3




************************************************



***************** FAILED TEST ******************


{'run_id': None, 'outcome': 11, 'cmpinfo': 'sudo: unable to resolve host ruvds-5dpq3\n', 'stdout': '', 'stderr': ''}

Python3 file I/O

Jobe result: Compile error


Compiler output:

sudo: unable to resolve host ruvds-5dpq3


Attachment error.png
In reply to Al Spay

Re: Problem with instalation Jobe

by Al Spay -

I'm sorry. Problem is solved. 

In /etc/hosts replaced 127.0.0.1 localhost

127.0.0.1 <my_server_name>